BDBM62418 MLS000051274::N-[1,3-bis(oxidanylidene)-2-(oxolan-2-ylmethyl)isoindol-5-yl]-4-(propanoylamino)benzamide::N-[1,3-diketo-2-(tetrahydrofurfuryl)isoindolin-5-yl]-4-propionamido-benzamide::N-[1,3-dioxo-2-(2-oxolanylmethyl)-5-isoindolyl]-4-(1-oxopropylamino)benzamide::N-[1,3-dioxo-2-(oxolan-2-ylmethyl)isoindol-5-yl]-4-(propanoylamino)benzamide::N-[1,3-dioxo-2-(tetrahydro-2-furanylmethyl)-2,3-dihydro-1H-isoindol-5-yl]-4-(propionylamino)benzamide::SMR000079301::cid_2966346
SMILES CCC(=O)Nc1ccc(cc1)C(=O)Nc1ccc2C(=O)N(CC3CCCO3)C(=O)c2c1
InChI Key InChIKey=ZQMZLVOVIGTCCI-UHFFFAOYSA-N
Data  2 IC50
  Tab Delimited (TSV)   2D SDfile   Computed 3D by Vconf -m prep SDfile
Find this compound or compounds like it in BindingDB:
Activity Spreadsheet -- Enzyme Inhibition Constant Data from BindingDB
Found 1 hit for monomerid = 62418
TargetEpstein-Barr nuclear antigen 1(Human herpesvirus 4)
The Scripps Research Institute Molecular Screening Center
Curated by PubChem BioAssay
LigandPNGBDBM62418(MLS000051274 | N-[1,3-bis(oxidanylidene)-2-(oxolan...)
Affinity DataIC50:  6.54E+3nM. Assay description: Source (MLPCN Center Name): The Scripps Research Institute Molecular Screening Center (SRIMSC) Center Affiliation: The Scripps Research Institute (TS...
In DepthDetails PCBioAssay